Reaction Details
TargetTransient receptor potential cation channel subfamily V member 1
LigandBDBM50272890
Substrate/Competitorn/a
Meas. Tech.ChEMBL_514802 (CHEMBL976411)
IC50 0.500000±n/a nM
Citation Blum, CAZheng, XBrielmann, HHodgetts, KJBakthavatchalam, RChandrasekhar, JKrause, JECortright, DMatson, DCrandall, MNgo, CKFung, LDay, MKershaw, MDe Lombaert, SChenard, BL Aminoquinazolines as TRPV1 antagonists: modulation of drug-like properties through the exploration of 2-position substitution. Bioorg Med Chem Lett18:4573-7 (2008) 
 
Transient receptor potential cation channel subfamily V member 1
Name:Transient receptor potential cation channel subfamily V member 1
Type:Protein
Mol. Mass.:94960.75
Organism:Homo sapiens (Human)
Description:Q8NER1
Residue:839
BDBM50272890
NameBDBM50272890
Synonyms:2-(benzyloxymethyl)-N-(4-(trifluoromethyl)phenyl)-7-(3-(trifluoromethyl)pyridin-2-yl)quinazolin-4-amine | CHEMBL456778
TypeSmall organic molecule
Emp. Form.C29H20F6N4O
Mol. Mass.554.4857
SMILESFC(F)(F)c1ccc(Nc2nc(COCc3ccccc3)nc3cc(ccc23)-c2ncccc2C(F)(F)F)cc1