Reaction Details
TargetTransient receptor potential cation channel subfamily V member 1
LigandBDBM50272889
Substrate/Competitorn/a
Meas. Tech.ChEMBL_514802 (CHEMBL976411)
IC50 0.300000±n/a nM
Citation Blum, CAZheng, XBrielmann, HHodgetts, KJBakthavatchalam, RChandrasekhar, JKrause, JECortright, DMatson, DCrandall, MNgo, CKFung, LDay, MKershaw, MDe Lombaert, SChenard, BL Aminoquinazolines as TRPV1 antagonists: modulation of drug-like properties through the exploration of 2-position substitution. Bioorg Med Chem Lett18:4573-7 (2008) 
 
Transient receptor potential cation channel subfamily V member 1
Name:Transient receptor potential cation channel subfamily V member 1
Type:Protein
Mol. Mass.:94960.75
Organism:Homo sapiens (Human)
Description:Q8NER1
Residue:839
BDBM50272889
NameBDBM50272889
Synonyms:2-(isopropoxymethyl)-N-(4-(trifluoromethyl)phenyl)-7-(3-(trifluoromethyl)pyridin-2-yl)quinazolin-4-amine | CHEMBL457188
TypeSmall organic molecule
Emp. Form.C25H20F6N4O
Mol. Mass.506.4429
SMILESCC(C)OCc1nc(Nc2ccc(cc2)C(F)(F)F)c2ccc(cc2n1)-c1ncccc1C(F)(F)F