Reaction Details
TargetTransient receptor potential cation channel subfamily V member 1
LigandBDBM50272897
Substrate/Competitorn/a
Meas. Tech.ChEMBL_509750 (CHEMBL997019)
Ki 225±n/a nM
Citation Cheung, WSCalvo, RRTounge, BAZhang, SPStone, DRBrandt, MRHutchinson, TFlores, CMPlayer, MR Discovery of piperidine carboxamide TRPV1 antagonists. Bioorg Med Chem Lett18:4569-72 (2008) 
 
Transient receptor potential cation channel subfamily V member 1
Name:Transient receptor potential cation channel subfamily V member 1
Type:Protein
Mol. Mass.:94960.75
Organism:Homo sapiens (Human)
Description:Q8NER1
Residue:839
BDBM50272897
NameBDBM50272897
Synonyms:CHEMBL455926 | N-(3-oxo-3,4-dihydro-2H-benzo[b][1,4]oxazin-6-yl)-1-m-tolylpiperidine-4-carboxamide
TypeSmall organic molecule
Emp. Form.C21H23N3O3
Mol. Mass.365.4256
SMILESCc1cccc(c1)N1CCC(CC1)C(=O)Nc1ccc2OCC(=O)Nc2c1