Reaction Details
TargetTransient receptor potential cation channel subfamily V member 1
LigandBDBM50272983
Substrate/Competitorn/a
Meas. Tech.ChEMBL_509750 (CHEMBL997019)
Ki 81±n/a nM
Citation Cheung, WSCalvo, RRTounge, BAZhang, SPStone, DRBrandt, MRHutchinson, TFlores, CMPlayer, MR Discovery of piperidine carboxamide TRPV1 antagonists. Bioorg Med Chem Lett18:4569-72 (2008) 
 
Transient receptor potential cation channel subfamily V member 1
Name:Transient receptor potential cation channel subfamily V member 1
Type:Protein
Mol. Mass.:94960.75
Organism:Homo sapiens (Human)
Description:Q8NER1
Residue:839
BDBM50272983
NameBDBM50272983
Synonyms:1-(2-bromo-3-fluorophenyl)-N-(3-oxo-3,4-dihydro-2H-benzo[b][1,4]oxazin-6-yl)piperidine-4-carboxamide | CHEMBL464384
TypeSmall organic molecule
Emp. Form.C20H19BrFN3O3
Mol. Mass.448.286
SMILESFc1cccc(N2CCC(CC2)C(=O)Nc2ccc3OCC(=O)Nc3c2)c1Br