Reaction Details
TargetProthrombin
LigandBDBM50273189
Substrate/Competitorn/a
Meas. Tech.ChEMBL_510031 (CHEMBL995174)
Ki>10000±n/a nM
Citation Uchida, MOkazaki, KMukaiyama, HIsawa, HKobayashi, HShiohara, HMuranaka, HKai, YKikuchi, NTakeuchi, HYokoyama, KTsuji, EOzawa, THoyano, YKoizumi, TMisawa, KHara, KNakano, SMurakami, YOkuno, H Orally active factor Xa inhibitors: investigation of a novel series of 3-amidinophenylsulfonamide derivatives using an amidoxime prodrug strategy. Bioorg Med Chem Lett18:4682-7 (2008) 
 
Prothrombin
Name:Prothrombin
Type:Protein
Mol. Mass.:70029.57
Organism:Homo sapiens (Human)
Description:P00734
Residue:622
BDBM50273189
NameBDBM50273189
Synonyms:3-[2-(4-Isopropyl-phenyl)-ethylsulfamoyl]-benzamidine | CHEMBL513433
TypeSmall organic molecule
Emp. Form.C18H23N3O2S
Mol. Mass.345.459
SMILESCC(C)c1ccc(CCNS(=O)(=O)c2cccc(c2)C(N)=N)cc1