Reaction Details
TargetCoagulation factor X
LigandBDBM50273136
Substrate/Competitorn/a
Meas. Tech.ChEMBL_510032 (CHEMBL995175)
Ki 500±n/a nM
Citation Uchida, MOkazaki, KMukaiyama, HIsawa, HKobayashi, HShiohara, HMuranaka, HKai, YKikuchi, NTakeuchi, HYokoyama, KTsuji, EOzawa, THoyano, YKoizumi, TMisawa, KHara, KNakano, SMurakami, YOkuno, H Orally active factor Xa inhibitors: investigation of a novel series of 3-amidinophenylsulfonamide derivatives using an amidoxime prodrug strategy. Bioorg Med Chem Lett18:4682-7 (2008) 
 
Coagulation factor X
Name:Coagulation factor X
Type:Enzyme
Mol. Mass.:54726.60
Organism:Homo sapiens (Human)
Description:n/a
Residue:488
BDBM50273136
NameBDBM50273136
Synonyms:CHEMBL455932 {4-[2-(5-Carbamimidoyl-2-hydroxy-benzenesulfonylamino)-ethyl]-2'-methanesulfonyl-biphenyl-3-yloxy}-acetic acid; hydrochloride
TypeSmall organic molecule
Emp. Form.C24H25N3O8S2
Mol. Mass.547.601
SMILESCS(=O)(=O)c1ccccc1-c1ccc(CCNS(=O)(=O)c2cc(ccc2O)C(N)=N)c(OCC(O)=O)c1