Reaction Details
TargetKappa-type opioid receptor
LigandBDBM50272498
Substrate/Competitorn/a
Meas. Tech.ChEMBL_510208 (CHEMBL1004824)
EC50 790±n/a nM
Citation Hilfiker, MAZhang, DDowdell, SEGoodman, KBMcAtee, JJDodson, JWViet, AQWang, GZSehon, CABehm, DJWu, ZCarballo, LHDouglas, SANeeb, MJ Aminomethylpiperazines as selective urotensin antagonists. Bioorg Med Chem Lett18:4470-3 (2008) 
 
Kappa-type opioid receptor
Name:Kappa-type opioid receptor
Type:G Protein-Coupled Receptor (GPCR)
Mol. Mass.:42648.76
Organism:Homo sapiens (Human)
Description:P41145
Residue:380
BDBM50272498
NameBDBM50272498
Synonyms:3-(2-(4-(5-bromo-2-methoxyphenylsulfonyl)-2-(pyrrolidin-1-ylmethyl)piperazin-1-yl)-2-oxoethyl)-5-chlorobenzo[d]oxazol-2(3H)-one | CHEMBL525554
TypeSmall organic molecule
Emp. Form.C25H28BrClN4O6S
Mol. Mass.627.935
SMILESCOc1ccc(Br)cc1S(=O)(=O)N1CCN(C(CN2CCCC2)C1)C(=O)Cn1c2cc(Cl)ccc2oc1=O