Reaction Details
TargetKappa-type opioid receptor
LigandBDBM50272475
Substrate/Competitorn/a
Meas. Tech.ChEMBL_510208 (CHEMBL1004824)
EC50 2000±n/a nM
Citation Hilfiker, MAZhang, DDowdell, SEGoodman, KBMcAtee, JJDodson, JWViet, AQWang, GZSehon, CABehm, DJWu, ZCarballo, LHDouglas, SANeeb, MJ Aminomethylpiperazines as selective urotensin antagonists. Bioorg Med Chem Lett18:4470-3 (2008) 
 
Kappa-type opioid receptor
Name:Kappa-type opioid receptor
Type:G Protein-Coupled Receptor (GPCR)
Mol. Mass.:42648.76
Organism:Homo sapiens (Human)
Description:P41145
Residue:380
BDBM50272475
NameBDBM50272475
Synonyms:5-chloro-3-(2-(4-(4-methoxyphenylsulfonyl)-2-(pyrrolidin-1-ylmethyl)piperazin-1-yl)-2-oxoethyl)benzo[d]oxazol-2(3H)-one | CHEMBL526842
TypeSmall organic molecule
Emp. Form.C25H29ClN4O6S
Mol. Mass.549.039
SMILESCOc1ccc(cc1)S(=O)(=O)N1CCN(C(CN2CCCC2)C1)C(=O)Cn1c2cc(Cl)ccc2oc1=O