Reaction Details
TargetKappa-type opioid receptor
LigandBDBM50272446
Substrate/Competitorn/a
Meas. Tech.ChEMBL_510208 (CHEMBL1004824)
EC50 1000±n/a nM
Citation Hilfiker, MAZhang, DDowdell, SEGoodman, KBMcAtee, JJDodson, JWViet, AQWang, GZSehon, CABehm, DJWu, ZCarballo, LHDouglas, SANeeb, MJ Aminomethylpiperazines as selective urotensin antagonists. Bioorg Med Chem Lett18:4470-3 (2008) 
 
Kappa-type opioid receptor
Name:Kappa-type opioid receptor
Type:G Protein-Coupled Receptor (GPCR)
Mol. Mass.:42648.76
Organism:Homo sapiens (Human)
Description:P41145
Residue:380
BDBM50272446
NameBDBM50272446
Synonyms:5-chloro-3-(2-(4-(2-chloro-5-(trifluoromethyl)phenylsulfonyl)-2-(pyrrolidin-1-ylmethyl)piperazin-1-yl)-2-oxoethyl)benzo[d]oxazol-2(3H)-one | CHEMBL503582
TypeSmall organic molecule
Emp. Form.C25H25Cl2F3N4O5S
Mol. Mass.621.456
SMILESFC(F)(F)c1ccc(Cl)c(c1)S(=O)(=O)N1CCN(C(CN2CCCC2)C1)C(=O)Cn1c2cc(Cl)ccc2oc1=O