Reaction Details
TargetKappa-type opioid receptor
LigandBDBM50272253
Substrate/Competitorn/a
Meas. Tech.ChEMBL_510208 (CHEMBL1004824)
EC50 4000±n/a nM
Citation Hilfiker, MAZhang, DDowdell, SEGoodman, KBMcAtee, JJDodson, JWViet, AQWang, GZSehon, CABehm, DJWu, ZCarballo, LHDouglas, SANeeb, MJ Aminomethylpiperazines as selective urotensin antagonists. Bioorg Med Chem Lett18:4470-3 (2008) 
 
Kappa-type opioid receptor
Name:Kappa-type opioid receptor
Type:G Protein-Coupled Receptor (GPCR)
Mol. Mass.:42648.76
Organism:Homo sapiens (Human)
Description:P41145
Residue:380
BDBM50272253
NameBDBM50272253
Synonyms:4-(2-((3,4-dichlorophenyl)(methyl)amino)acetyl)-N-phenyl-3-(pyrrolidin-1-ylmethyl)piperazine-1-carboxamide | CHEMBL502819
TypeSmall organic molecule
Emp. Form.C25H31Cl2N5O2
Mol. Mass.504.452
SMILESCN(CC(=O)N1CCN(CC1CN1CCCC1)C(=O)Nc1ccccc1)c1ccc(Cl)c(Cl)c1