Reaction Details
TargetMu-type opioid receptor
LigandBDBM50272375
Substrate/Competitorn/a
Meas. Tech.ChEMBL_510225 (CHEMBL1005603)
Ki 10±n/a nM
Citation Fulton, BSKnapp, BIBidlack, JMNeumeyer, JL Synthesis and pharmacological evaluation of hydrophobic esters and ethers of butorphanol at opioid receptors. Bioorg Med Chem Lett18:4474-6 (2008) 
 
Mu-type opioid receptor
Name:Mu-type opioid receptor
Type:G Protein-Coupled Receptor (GPCR)
Mol. Mass.:44789.51
Organism:Homo sapiens (Human)
Description:P35372
Residue:400
BDBM50272375
NameBDBM50272375
Synonyms:(1S,9R,10S)-17-(cyclobutylmethyl)-4-(2-phenylethoxy)-17-azatetracyclo[7.5.3.0^{1,10}.0^{2,7}]heptadeca-2(7),3,5-trien-10-ol hydrochloride | CHEMBL501447
TypeSmall organic molecule
Emp. Form.C29H37NO2
Mol. Mass.431.6096
SMILESO[C@@]12CCCC[C@@]11CCN(CC3CCC3)[C@@H]2Cc2ccc(OCCc3ccccc3)cc12