Reaction Details
TargetMu-type opioid receptor
LigandBDBM50272297
Substrate/Competitorn/a
Meas. Tech.ChEMBL_510225 (CHEMBL1005603)
Ki 2.3±n/a nM
Citation Fulton, BSKnapp, BIBidlack, JMNeumeyer, JL Synthesis and pharmacological evaluation of hydrophobic esters and ethers of butorphanol at opioid receptors. Bioorg Med Chem Lett18:4474-6 (2008) 
 
Mu-type opioid receptor
Name:Mu-type opioid receptor
Type:G Protein-Coupled Receptor (GPCR)
Mol. Mass.:44789.51
Organism:Homo sapiens (Human)
Description:P35372
Residue:400
BDBM50272297
NameBDBM50272297
Synonyms:(1S,9R,10S)-17-(cyclobutylmethyl)-10-hydroxy-17-azatetracyclo[7.5.3.0^{1,10}.0^{2,7}]heptadeca-2(7),3,5-trien-4-yl 2-(4-methylphenyl)propanoate hydrochloride | CHEMBL500154
TypeSmall organic molecule
Emp. Form.C31H39NO3
Mol. Mass.473.6463
SMILESCC(C(=O)Oc1ccc2C[C@H]3N(CC4CCC4)CC[C@@]4(CCCC[C@@]34O)c2c1)c1ccc(C)cc1