Reaction Details
TargetKappa-type opioid receptor
LigandBDBM50272331
Substrate/Competitorn/a
Meas. Tech.ChEMBL_510227 (CHEMBL1005605)
Ki 28±n/a nM
Citation Fulton, BSKnapp, BIBidlack, JMNeumeyer, JL Synthesis and pharmacological evaluation of hydrophobic esters and ethers of butorphanol at opioid receptors. Bioorg Med Chem Lett18:4474-6 (2008) 
 
Kappa-type opioid receptor
Name:Kappa-type opioid receptor
Type:G Protein-Coupled Receptor (GPCR)
Mol. Mass.:42648.76
Organism:Homo sapiens (Human)
Description:P41145
Residue:380
BDBM50272331
NameBDBM50272331
Synonyms:(1S,9R,10S)-4-(benzyloxy)-17-(cyclobutylmethyl)-17-azatetracyclo[7.5.3.0^{1,10}.0^{2,7}]heptadeca-2(7),3,5-trien-10-ol hydrochloride | CHEMBL524505
TypeSmall organic molecule
Emp. Form.C28H35NO2
Mol. Mass.417.583
SMILESO[C@@]12CCCC[C@@]11CCN(CC3CCC3)[C@@H]2Cc2ccc(OCc3ccccc3)cc12