Reaction Details
TargetMu-type opioid receptor
LigandBDBM50179191
Substrate/Competitorn/a
Meas. Tech.ChEMBL_510434 (CHEMBL1003110)
IC50 0.13±n/a nM
Citation Balboni, GFiorini, SBaldisserotto, ATrapella, CSasaki, YAmbo, AMarczak, EDLazarus, LHSalvadori, S Further studies on lead compounds containing the opioid pharmacophore Dmt-Tic. J Med Chem51:5109-17 (2008) 
 
Mu-type opioid receptor
Name:Mu-type opioid receptor
Synonyms:Mu-opioid receptor
Type:PROTEIN
Mol. Mass.:44729.40
Organism:Cavia porcellus
Description:ChEMBL_510437
Residue:400
BDBM50179191
NameBDBM50179191
TypeSmall organic molecule
Emp. Form.C29H31N5O3
Mol. Mass.497.5881
SMILESCc1cc(O)cc(C)c1C[C@H](N)C(=O)N1Cc2ccccc2C[C@H]1C(=O)NCc1nc2ccccc2[nH]1