Reaction Details
TargetDelta-type opioid receptor
LigandBDBM50272229
Substrate/Competitorn/a
Meas. Tech.ChEMBL_510435 (CHEMBL1003111)
IC50 179±n/a nM
Citation Balboni, GFiorini, SBaldisserotto, ATrapella, CSasaki, YAmbo, AMarczak, EDLazarus, LHSalvadori, S Further studies on lead compounds containing the opioid pharmacophore Dmt-Tic. J Med Chem51:5109-17 (2008) 
 
Delta-type opioid receptor
Name:Delta-type opioid receptor
Type:Enzyme Catalytic Domain
Mol. Mass.:40577.25
Organism:MOUSE
Description:P32300
Residue:372
BDBM50272229
NameBDBM50272229
Synonyms:CHEMBL444197 | H-Dmt-Tic-NH-(R)CH(CH2-COOH)-Bid
TypeSmall organic molecule
Emp. Form.C31H33N5O5
Mol. Mass.555.6242
SMILESCc1cc(O)cc(C)c1C[C@H](N)C(=O)N1Cc2ccccc2C[C@H]1C(=O)N[C@H](CC(O)=O)c1nc2ccccc2[nH]1