Reaction Details
TargetDelta-type opioid receptor
LigandBDBM50272226
Substrate/Competitorn/a
Meas. Tech.ChEMBL_510435 (CHEMBL1003111)
IC50>10000±n/a nM
Citation Balboni, GFiorini, SBaldisserotto, ATrapella, CSasaki, YAmbo, AMarczak, EDLazarus, LHSalvadori, S Further studies on lead compounds containing the opioid pharmacophore Dmt-Tic. J Med Chem51:5109-17 (2008) 
 
Delta-type opioid receptor
Name:Delta-type opioid receptor
Type:Enzyme Catalytic Domain
Mol. Mass.:40577.25
Organism:MOUSE
Description:P32300
Residue:372
BDBM50272226
NameBDBM50272226
Synonyms:CHEMBL502302 | H-Dmt-Tic-D-Asp-N(Me)-Ph
TypeSmall organic molecule
Emp. Form.C32H36N4O6
Mol. Mass.572.6514
SMILESCN(C(=O)[C@@H](CC(O)=O)NC(=O)[C@@H]1Cc2ccccc2CN1C(=O)[C@@H](N)Cc1c(C)cc(O)cc1C)c1ccccc1