Reaction Details
TargetDelta-type opioid receptor
LigandBDBM50272171
Substrate/Competitorn/a
Meas. Tech.ChEMBL_510432 (CHEMBL1003108)
Ki 0.036±n/a nM
Citation Balboni, GFiorini, SBaldisserotto, ATrapella, CSasaki, YAmbo, AMarczak, EDLazarus, LHSalvadori, S Further studies on lead compounds containing the opioid pharmacophore Dmt-Tic. J Med Chem51:5109-17 (2008) 
 
Delta-type opioid receptor
Name:Delta-type opioid receptor
Type:G Protein-Coupled Receptor (GPCR)
Mol. Mass.:40465.04
Organism:Rattus norvegicus (rat)
Description:Competition binding assays were using CHO-K1 cell membranes expressing the opioid receptor.
Residue:372
BDBM50272171
NameBDBM50272171
Synonyms:CHEMBL501202 | H-Dmt-Tic-Asp-NH-Ph
TypeSmall organic molecule
Emp. Form.C31H34N4O6
Mol. Mass.558.6249
SMILESCc1cc(O)cc(C)c1C[C@H](N)C(=O)N1Cc2ccccc2C[C@H]1C(=O)N[C@@H](CC(O)=O)C(=O)Nc1ccccc1