Reaction Details
TargetMelanocortin receptor 4
LigandBDBM50245331
Substrate/Competitorn/a
Meas. Tech.ChEMBL_513112 (CHEMBL973601)
Ki 6.3±n/a nM
Citation Marinkovic, DTucci, FCTran, JAFleck, BAWen, JChen, C Structure-activity relationship studies on a series of piperazinebenzylalcohols and their ketone and amine analogs as melanocortin-4 receptor ligands. Bioorg Med Chem Lett18:4817-22 (2008) 
 
Melanocortin receptor 4
Name:Melanocortin receptor 4
Type:Enzyme
Mol. Mass.:36949.50
Organism:Homo sapiens (Human)
Description:P32245
Residue:332
BDBM50245331
NameBDBM50245331
Synonyms:(1S,2S)-ethyl 2-(4-((R)-2-(3-aminopropanamido)-3-(2,4-dichlorophenyl)propanoyl)piperazin-1-yl)cyclohexanecarboxylate | CHEMBL462380
TypeSmall organic molecule
Emp. Form.C25H36Cl2N4O4
Mol. Mass.527.484
SMILESCCOC(=O)[C@H]1CCCC[C@@H]1N1CCN(CC1)C(=O)[C@@H](Cc1ccc(Cl)cc1Cl)NC(=O)CCN