Reaction Details
TargetMelanocortin receptor 4
LigandBDBM50189237
Substrate/Competitorn/a
Meas. Tech.ChEMBL_513112 (CHEMBL973601)
Ki 74±n/a nM
Citation Marinkovic, DTucci, FCTran, JAFleck, BAWen, JChen, C Structure-activity relationship studies on a series of piperazinebenzylalcohols and their ketone and amine analogs as melanocortin-4 receptor ligands. Bioorg Med Chem Lett18:4817-22 (2008) 
 
Melanocortin receptor 4
Name:Melanocortin receptor 4
Type:Enzyme
Mol. Mass.:36949.50
Organism:Homo sapiens (Human)
Description:P32245
Residue:332
BDBM50189237
NameBDBM50189237
Synonyms:(1S)-[2-{4-[3-(2,4-dichlorophenyl)propionyl]-1-piperazinyl}-5-(trifluoromethyl)phenyl]-3-methylbutylamine CHEMBL213738
TypeSmall organic molecule
Emp. Form.C25H30Cl2F3N3O
Mol. Mass.516.426
SMILESCC(C)C[C@H](N)c1cc(ccc1N1CCN(CC1)C(=O)CCc1ccc(Cl)cc1Cl)C(F)(F)F