Reaction Details
TargetMelanocortin receptor 4
LigandBDBM50152808
Substrate/Competitorn/a
Meas. Tech.ChEMBL_513112 (CHEMBL973601)
Ki 11±n/a nM
Citation Marinkovic, DTucci, FCTran, JAFleck, BAWen, JChen, C Structure-activity relationship studies on a series of piperazinebenzylalcohols and their ketone and amine analogs as melanocortin-4 receptor ligands. Bioorg Med Chem Lett18:4817-22 (2008) 
 
Melanocortin receptor 4
Name:Melanocortin receptor 4
Type:Enzyme
Mol. Mass.:36949.50
Organism:Homo sapiens (Human)
Description:P32245
Residue:332
BDBM50152808
NameBDBM50152808
Synonyms:(R)-1,2,3,4-Tetrahydro-isoquinoline-3-carboxylic acid [(R)-1-(4-chloro-benzyl)-2-oxo-2-(4-{2-[(2-thiophen-2-yl-ethylamino)-methyl]-phenyl}-piperazin-1-yl)-ethyl]-amide 4-(2R)-[(3R)-1,2,3,4-tetrahydroisoquinolinylcarboxamido]-3-(4-chlorophenyl)propionyl-1-[2[2-(2-thienyl)-ethylaminomethyl]methyl]phenyl piperazine NBI-55886
TypeSmall organic molecule
Emp. Form.C36H40ClN5O2S
Mol. Mass.642.253
SMILESClc1ccc(C[C@@H](NC(=O)[C@H]2Cc3ccccc3CN2)C(=O)N2CCN(CC2)c2ccccc2CNCCc2cccs2)cc1