Reaction Details
TargetMelanocortin receptor 4
LigandBDBM50245674
Substrate/Competitorn/a
Meas. Tech.ChEMBL_513112 (CHEMBL973601)
Ki 66±n/a nM
Citation Marinkovic, DTucci, FCTran, JAFleck, BAWen, JChen, C Structure-activity relationship studies on a series of piperazinebenzylalcohols and their ketone and amine analogs as melanocortin-4 receptor ligands. Bioorg Med Chem Lett18:4817-22 (2008) 
 
Melanocortin receptor 4
Name:Melanocortin receptor 4
Type:Enzyme
Mol. Mass.:36949.50
Organism:Homo sapiens (Human)
Description:P32245
Residue:332
BDBM50245674
NameBDBM50245674
Synonyms:3-amino-N-((R)-3-(2,4-dichlorophenyl)-1-(4-(2-(1-hydroxy-2-(2-methoxyphenyl)ethyl)phenyl)piperazin-1-yl)-1-oxopropan-2-yl)propanamide | CHEMBL455188
TypeSmall organic molecule
Emp. Form.C31H36Cl2N4O4
Mol. Mass.599.548
SMILESCOc1ccccc1CC(O)c1ccccc1N1CCN(CC1)C(=O)[C@@H](Cc1ccc(Cl)cc1Cl)NC(=O)CCN