Reaction Details
TargetMelanocortin receptor 4
LigandBDBM50245330
Substrate/Competitorn/a
Meas. Tech.ChEMBL_513112 (CHEMBL973601)
Ki 53±n/a nM
Citation Marinkovic, DTucci, FCTran, JAFleck, BAWen, JChen, C Structure-activity relationship studies on a series of piperazinebenzylalcohols and their ketone and amine analogs as melanocortin-4 receptor ligands. Bioorg Med Chem Lett18:4817-22 (2008) 
 
Melanocortin receptor 4
Name:Melanocortin receptor 4
Type:Enzyme
Mol. Mass.:36949.50
Organism:Homo sapiens (Human)
Description:P32245
Residue:332
BDBM50245330
NameBDBM50245330
Synonyms:(2R)-1-(4-(2-(1-amino-3-methylbutyl)phenyl)piperazin-1-yl)-3-(2,4-dichlorophenyl)-2-(isopropylamino)propan-1-one | CHEMBL516659
TypeSmall organic molecule
Emp. Form.C27H38Cl2N4O
Mol. Mass.505.523
SMILESCC(C)CC(N)c1ccccc1N1CCN(CC1)C(=O)[C@@H](Cc1ccc(Cl)cc1Cl)NC(C)C