Reaction Details
TargetMelanocortin receptor 5
LigandBDBM50245765
Substrate/Competitorn/a
Meas. Tech.ChEMBL_513117 (CHEMBL973606)
Ki 540±n/a nM
Citation Marinkovic, DTucci, FCTran, JAFleck, BAWen, JChen, C Structure-activity relationship studies on a series of piperazinebenzylalcohols and their ketone and amine analogs as melanocortin-4 receptor ligands. Bioorg Med Chem Lett18:4817-22 (2008) 
 
Melanocortin receptor 5
Name:Melanocortin receptor 5
Type:Enzyme
Mol. Mass.:36612.92
Organism:Homo sapiens (Human)
Description:P33032
Residue:325
BDBM50245765
NameBDBM50245765
Synonyms:CHEMBL454916 | N-((R)-3-(2,4-dichlorophenyl)-1-(4-(2-(1-hydroxy-3-methylbutyl)phenyl)piperazin-1-yl)-1-oxopropan-2-yl)-2-(dimethylamino)acetamide
TypeSmall organic molecule
Emp. Form.C28H38Cl2N4O3
Mol. Mass.549.532
SMILESCC(C)CC(O)c1ccccc1N1CCN(CC1)C(=O)[C@@H](Cc1ccc(Cl)cc1Cl)NC(=O)CN(C)C