Reaction Details
TargetB1 bradykinin receptor
LigandBDBM50244439
Substrate/Competitorn/a
Meas. Tech.ChEMBL_512956 (CHEMBL977292)
Ki 12.7±n/a nM
Citation Biswas, KAya, TQian, WPeterkin, TAChen, JJHuman, JHungate, RWKumar, GArik, LLester-Zeiner, DBiddlecome, GManning, BHSun, HDong, HHuang, MLoeloff, RJohnson, EJAskew, BC Aryl sulfones as novel bradykinin B1 receptor antagonists for treatment of chronic pain. Bioorg Med Chem Lett18:4764-9 (2008) 
 
B1 bradykinin receptor
Name:B1 bradykinin receptor
Type:Enzyme
Mol. Mass.:40508.87
Organism:Homo sapiens (Human)
Description:P46663
Residue:353
BDBM50244439
NameBDBM50244439
Synonyms:(2R,3S)-4-(2,3-dichlorophenylsulfonyl)-2,3-dihydroxy-N-((R)-6-(piperidin-1-ylmethyl)-1,2,3,4-tetrahydronaphthalen-1-yl)butanamide | CHEMBL488501
TypeSmall organic molecule
Emp. Form.C26H32Cl2N2O5S
Mol. Mass.555.514
SMILESO[C@H](CS(=O)(=O)c1cccc(Cl)c1Cl)[C@@H](O)C(=O)N[C@@H]1CCCc2cc(CN3CCCCC3)ccc12