Reaction Details
TargetB1 bradykinin receptor
LigandBDBM50244437
Substrate/Competitorn/a
Meas. Tech.ChEMBL_512956 (CHEMBL977292)
Ki 15.8±n/a nM
Citation Biswas, KAya, TQian, WPeterkin, TAChen, JJHuman, JHungate, RWKumar, GArik, LLester-Zeiner, DBiddlecome, GManning, BHSun, HDong, HHuang, MLoeloff, RJohnson, EJAskew, BC Aryl sulfones as novel bradykinin B1 receptor antagonists for treatment of chronic pain. Bioorg Med Chem Lett18:4764-9 (2008) 
 
B1 bradykinin receptor
Name:B1 bradykinin receptor
Type:Enzyme
Mol. Mass.:40508.87
Organism:Homo sapiens (Human)
Description:P46663
Residue:353
BDBM50244437
NameBDBM50244437
Synonyms:(2R,3S)-4-(4-tert-butylphenylsulfonyl)-2,3-dihydroxy-N-((R)-6-(piperidin-1-ylmethyl)-1,2,3,4-tetrahydronaphthalen-1-yl)butanamide | CHEMBL486456
TypeSmall organic molecule
Emp. Form.C30H42N2O5S
Mol. Mass.542.73
SMILESCC(C)(C)c1ccc(cc1)S(=O)(=O)C[C@@H](O)[C@@H](O)C(=O)N[C@@H]1CCCc2cc(CN3CCCCC3)ccc12