Reaction Details
TargetB1 bradykinin receptor
LigandBDBM50244435
Substrate/Competitorn/a
Meas. Tech.ChEMBL_512957 (CHEMBL977293)
IC50 48.9±n/a nM
Citation Biswas, KAya, TQian, WPeterkin, TAChen, JJHuman, JHungate, RWKumar, GArik, LLester-Zeiner, DBiddlecome, GManning, BHSun, HDong, HHuang, MLoeloff, RJohnson, EJAskew, BC Aryl sulfones as novel bradykinin B1 receptor antagonists for treatment of chronic pain. Bioorg Med Chem Lett18:4764-9 (2008) 
 
B1 bradykinin receptor
Name:B1 bradykinin receptor
Type:Enzyme
Mol. Mass.:40508.87
Organism:Homo sapiens (Human)
Description:P46663
Residue:353
BDBM50244435
NameBDBM50244435
Synonyms:(S)-3-hydroxy-4-(naphthalen-2-ylsulfonyl)-N-((R)-6-(piperidin-1-ylmethyl)-1,2,3,4-tetrahydronaphthalen-1-yl)butanamide | CHEMBL530554
TypeSmall organic molecule
Emp. Form.C30H36N2O4S
Mol. Mass.520.683
SMILESO[C@@H](CC(=O)N[C@@H]1CCCc2cc(CN3CCCCC3)ccc12)CS(=O)(=O)c1ccc2ccccc2c1