Reaction Details
TargetProtein kinase C alpha type
LigandBDBM50244448
Substrate/Competitorn/a
Meas. Tech.ChEMBL_513186 (CHEMBL977316)
Ki 132±n/a nM
Citation El Kazzouli, SLewin, NEBlumberg, PMMarquez, VE Conformationally constrained analogues of diacylglycerol. 30. An investigation of diacylglycerol-lactones containing heteroaryl groups reveals compounds with high selectivity for Ras guanyl nucleotide-releasing proteins. J Med Chem51:5371-86 (2008) 
 
Protein kinase C alpha type
Name:Protein kinase C alpha type
Type:Enzyme
Mol. Mass.:76755.65
Organism:Homo sapiens (Human)
Description:The recombinant human PKC enzymes were produced using a baculovirus expression system in SF9 cells
Residue:672
BDBM50244448
NameBDBM50244448
Synonyms:(E)-(2-(hydroxymethyl)-5-oxo-4-(quinolin-2-ylmethylene)-tetrahydrofuran-2-yl)methyl 4-methoxybenzoate | CHEMBL487473
TypeSmall organic molecule
Emp. Form.C24H21NO6
Mol. Mass.419.4266
SMILESCOc1ccc(cc1)C(=O)OCC1(CO)C\C(=C/c2ccc3ccccc3n2)C(=O)O1