Reaction Details
TargetProtein kinase C alpha type
LigandBDBM50244475
Substrate/Competitorn/a
Meas. Tech.ChEMBL_513186 (CHEMBL977316)
Ki 34100±n/a nM
Citation El Kazzouli, SLewin, NEBlumberg, PMMarquez, VE Conformationally constrained analogues of diacylglycerol. 30. An investigation of diacylglycerol-lactones containing heteroaryl groups reveals compounds with high selectivity for Ras guanyl nucleotide-releasing proteins. J Med Chem51:5371-86 (2008) 
 
Protein kinase C alpha type
Name:Protein kinase C alpha type
Type:Enzyme
Mol. Mass.:76755.65
Organism:Homo sapiens (Human)
Description:The recombinant human PKC enzymes were produced using a baculovirus expression system in SF9 cells
Residue:672
BDBM50244475
NameBDBM50244475
Synonyms:(Z)-(2-(hydroxymethyl)-5-oxo-4-(pyridin-3-ylmethylene)-tetrahydrofuran-2-yl)methyl 4-(dimethylamino)benzoate | CHEMBL488506
TypeSmall organic molecule
Emp. Form.C21H22N2O5
Mol. Mass.382.4098
SMILESCN(C)c1ccc(cc1)C(=O)OCC1(CO)C\C(=C\c2cccnc2)C(=O)O1