Reaction Details
TargetRas guanyl-releasing protein 3
LigandBDBM50244449
Substrate/Competitorn/a
Meas. Tech.ChEMBL_513189 (CHEMBL977319)
Ki 0.18±n/a nM
Citation El Kazzouli, SLewin, NEBlumberg, PMMarquez, VE Conformationally constrained analogues of diacylglycerol. 30. An investigation of diacylglycerol-lactones containing heteroaryl groups reveals compounds with high selectivity for Ras guanyl nucleotide-releasing proteins. J Med Chem51:5371-86 (2008) 
 
Ras guanyl-releasing protein 3
Name:Ras guanyl-releasing protein 3
Type:PROTEIN
Mol. Mass.:78335.20
Organism:Homo sapiens (Human)
Description:ChEMBL_1364407
Residue:690
BDBM50244449
NameBDBM50244449
Synonyms:(E)-(2-(hydroxymethyl)-4-((1-methyl-1H-indol-3-yl)methylene)-5-oxo-tetrahydrofuran-2-yl)methyl 2-propylpentanoate | CHEMBL519741
TypeSmall organic molecule
Emp. Form.C24H31NO5
Mol. Mass.413.5066
SMILESCCCC(CCC)C(=O)OCC1(CO)C\C(=C/c2cn(C)c3ccccc23)C(=O)O1