Reaction Details
TargetRas guanyl-releasing protein 3
LigandBDBM50245021
Substrate/Competitorn/a
Meas. Tech.ChEMBL_513189 (CHEMBL977319)
Ki 4.6±n/a nM
Citation El Kazzouli, SLewin, NEBlumberg, PMMarquez, VE Conformationally constrained analogues of diacylglycerol. 30. An investigation of diacylglycerol-lactones containing heteroaryl groups reveals compounds with high selectivity for Ras guanyl nucleotide-releasing proteins. J Med Chem51:5371-86 (2008) 
 
Ras guanyl-releasing protein 3
Name:Ras guanyl-releasing protein 3
Type:PROTEIN
Mol. Mass.:78335.20
Organism:Homo sapiens (Human)
Description:ChEMBL_1364407
Residue:690
BDBM50245021
NameBDBM50245021
Synonyms:(Z)-(2-(hydroxymethyl)-5-oxo-4-(quinolin-2-ylmethylene)-tetrahydrofuran-2-yl)methyl 2-propylpentanoate | CHEMBL488871
TypeSmall organic molecule
Emp. Form.C24H29NO5
Mol. Mass.411.4908
SMILESCCCC(CCC)C(=O)OCC1(CO)C\C(=C\c2ccc3ccccc3n2)C(=O)O1