Reaction Details
TargetRas guanyl-releasing protein 3
LigandBDBM50244448
Substrate/Competitorn/a
Meas. Tech.ChEMBL_513189 (CHEMBL977319)
Ki 8.2±n/a nM
Citation El Kazzouli, SLewin, NEBlumberg, PMMarquez, VE Conformationally constrained analogues of diacylglycerol. 30. An investigation of diacylglycerol-lactones containing heteroaryl groups reveals compounds with high selectivity for Ras guanyl nucleotide-releasing proteins. J Med Chem51:5371-86 (2008) 
 
Ras guanyl-releasing protein 3
Name:Ras guanyl-releasing protein 3
Type:PROTEIN
Mol. Mass.:78335.20
Organism:Homo sapiens (Human)
Description:ChEMBL_1364407
Residue:690
BDBM50244448
NameBDBM50244448
Synonyms:(E)-(2-(hydroxymethyl)-5-oxo-4-(quinolin-2-ylmethylene)-tetrahydrofuran-2-yl)methyl 4-methoxybenzoate | CHEMBL487473
TypeSmall organic molecule
Emp. Form.C24H21NO6
Mol. Mass.419.4266
SMILESCOc1ccc(cc1)C(=O)OCC1(CO)C\C(=C/c2ccc3ccccc3n2)C(=O)O1