Reaction Details
TargetRas guanyl-releasing protein 3
LigandBDBM50244450
Substrate/Competitorn/a
Meas. Tech.ChEMBL_513189 (CHEMBL977319)
Ki 0.20±n/a nM
Citation El Kazzouli, SLewin, NEBlumberg, PMMarquez, VE Conformationally constrained analogues of diacylglycerol. 30. An investigation of diacylglycerol-lactones containing heteroaryl groups reveals compounds with high selectivity for Ras guanyl nucleotide-releasing proteins. J Med Chem51:5371-86 (2008) 
 
Ras guanyl-releasing protein 3
Name:Ras guanyl-releasing protein 3
Type:PROTEIN
Mol. Mass.:78335.20
Organism:Homo sapiens (Human)
Description:ChEMBL_1364407
Residue:690
BDBM50244450
NameBDBM50244450
Synonyms:(E)-(2-(hydroxymethyl)-5-oxo-4-(pyridin-2-ylmethylene)-tetrahydrofuran-2-yl)methyl 2-isobutyl-4-methylpentanoate | CHEMBL530110
TypeSmall organic molecule
Emp. Form.C22H31NO5
Mol. Mass.389.4852
SMILESCC(C)CC(CC(C)C)C(=O)OCC1(CO)C\C(=C/c2ccccn2)C(=O)O1