Reaction Details
TargetReceptor-type tyrosine-protein phosphatase epsilon
LigandBDBM50222205
Substrate/Competitorn/a
Meas. Tech.ChEMBL_557720 (CHEMBL963015)
IC50>40000±n/a nM
Citation Zhang, YNZhang, WHong, DShi, LShen, QLi, JYLi, JHu, LH Oleanolic acid and its derivatives: new inhibitor of protein tyrosine phosphatase 1B with cellular activities. Bioorg Med Chem16:8697-705 (2008) 
 
Receptor-type tyrosine-protein phosphatase epsilon
Name:Receptor-type tyrosine-protein phosphatase epsilon
Type:Protein
Mol. Mass.:80646.31
Organism:Homo sapiens (Human)
Description:P23469
Residue:700
BDBM50222205
NameBDBM50222205
Synonyms:(1S,2R,4aS,6aS,6bR,8aR,10R,11R,12aR,12bR,14bS)-10,11-dihydroxy-1,2,6a,6b,9,9,12a-heptamethyl-1,2,3,4,4a,5,6,6a,6b,7,8,8a,9,10,11,12,12a,12b,13,14b-icosahydropicene-4a-carboxylic acid 2alpha,2beta-dihydroxy-18beta-ursan-12-ene-28-oic acid CHEMBL391533 US11660306, Example Corosolic acid
TypeSmall organic molecule
Emp. Form.C30H48O4
Mol. Mass.472.6997
SMILESC[C@@H]1CC[C@@]2(CC[C@]3(C)C(=CC[C@@H]4[C@@]5(C)C[C@@H](O)[C@H](O)C(C)(C)[C@@H]5CC[C@@]34C)[C@@H]2[C@H]1C)C(O)=O