Reaction Details
TargetReceptor-type tyrosine-protein phosphatase epsilon
LigandBDBM50246653
Substrate/Competitorn/a
Meas. Tech.ChEMBL_557720 (CHEMBL963015)
IC50>40000±n/a nM
Citation Zhang, YNZhang, WHong, DShi, LShen, QLi, JYLi, JHu, LH Oleanolic acid and its derivatives: new inhibitor of protein tyrosine phosphatase 1B with cellular activities. Bioorg Med Chem16:8697-705 (2008) 
 
Receptor-type tyrosine-protein phosphatase epsilon
Name:Receptor-type tyrosine-protein phosphatase epsilon
Type:Protein
Mol. Mass.:80646.31
Organism:Homo sapiens (Human)
Description:P23469
Residue:700
BDBM50246653
NameBDBM50246653
Synonyms:(S)-2-(5-((4aR,6aS,6bR,8aR,10S,12aR,12bR,14bR)-10-hydroxy-2,2,6a,6b,9,9,12a-heptamethyl-1,2,3,4,4a,5,6,6a,6b,7,8,8a,9,10,11,12,12a,12b,13,14b-icosahydropicen-4a-yl)pentanamido)-3-phenylpropanoic acid | CHEMBL509443
TypeSmall organic molecule
Emp. Form.C43H65NO4
Mol. Mass.659.9805
SMILESCC1(C)CC[C@]2(CCCCC(=O)N[C@@H](Cc3ccccc3)C(O)=O)CC[C@]3(C)C(=CC[C@@H]4[C@@]5(C)CC[C@H](O)C(C)(C)[C@@H]5CC[C@@]34C)[C@@H]2C1