Reaction Details
TargetCannabinoid receptor 2
LigandBDBM50253530
Substrate/Competitorn/a
Meas. Tech.ChEMBL_510958 (CHEMBL1003145)
IC50 2737.4±n/a nM
Citation Tseng, SLHung, MSChang, CPSong, JSTai, CLChiu, HHHsieh, WPLin, YChung, WLKuo, CWWu, CHChu, CMTung, YSChao, YSShia, KS Bioisosteric replacement of the pyrazole 5-aryl moiety of N-(piperidin-1-yl)-5-(4-chlorophenyl)-1-(2,4-dichlorophenyl)-4-methyl-1H-pyrazole-3-carboxamide (SR141716A). A novel series of alkynylthiophenes as potent and selective cannabinoid-1 receptor antagonists. J Med Chem51:5397-412 (2008) 
 
Cannabinoid receptor 2
Name:Cannabinoid receptor 2
Type:G Protein-Coupled Receptor (GPCR)
Mol. Mass.:39690.94
Organism:Homo sapiens (Human)
Description:P34972
Residue:360
BDBM50253530
NameBDBM50253530
Synonyms:1-(2,4-Dichlorophenyl)-5-(5-(3-methoxyprop-1-ynyl)thiophen-2-yl)-4-methyl-N-(piperidin-1-yl)-1H-pyrazole-3-carboxamide | CHEMBL492486
TypeSmall organic molecule
Emp. Form.C24H24Cl2N4O2S
Mol. Mass.503.444
SMILESCOCC#Cc1ccc(s1)-c1c(C)c(nn1-c1ccc(Cl)cc1Cl)C(=O)NN1CCCCC1