Reaction Details
TargetCannabinoid receptor 1
LigandBDBM50253475
Substrate/Competitorn/a
Meas. Tech.ChEMBL_510960 (CHEMBL1003147)
IC50 21±n/a nM
Citation Tseng, SLHung, MSChang, CPSong, JSTai, CLChiu, HHHsieh, WPLin, YChung, WLKuo, CWWu, CHChu, CMTung, YSChao, YSShia, KS Bioisosteric replacement of the pyrazole 5-aryl moiety of N-(piperidin-1-yl)-5-(4-chlorophenyl)-1-(2,4-dichlorophenyl)-4-methyl-1H-pyrazole-3-carboxamide (SR141716A). A novel series of alkynylthiophenes as potent and selective cannabinoid-1 receptor antagonists. J Med Chem51:5397-412 (2008) 
 
Cannabinoid receptor 1
Name:Cannabinoid receptor 1
Type:G Protein-Coupled Receptor (GPCR)
Mol. Mass.:52868.96
Organism:Homo sapiens (Human)
Description:P21554
Residue:472
BDBM50253475
NameBDBM50253475
Synonyms:5-(5-(Cyclopropylethynyl)thiophen-2-yl)-1-(2,4-dichlorophenyl)-N-(hexahydrocyclopenta[c]pyrrol-2(1H)-yl)-4-methyl-1H-pyrazole-3-carboxamide | CHEMBL493917
TypeSmall organic molecule
Emp. Form.C27H26Cl2N4OS
Mol. Mass.525.493
SMILESCc1c(nn(c1-c1ccc(s1)C#CC1CC1)-c1ccc(Cl)cc1Cl)C(=O)NN1CC2CCCC2C1