Reaction Details
TargetCannabinoid receptor 1
LigandBDBM50253474
Substrate/Competitorn/a
Meas. Tech.ChEMBL_510960 (CHEMBL1003147)
IC50 60.4±n/a nM
Citation Tseng, SLHung, MSChang, CPSong, JSTai, CLChiu, HHHsieh, WPLin, YChung, WLKuo, CWWu, CHChu, CMTung, YSChao, YSShia, KS Bioisosteric replacement of the pyrazole 5-aryl moiety of N-(piperidin-1-yl)-5-(4-chlorophenyl)-1-(2,4-dichlorophenyl)-4-methyl-1H-pyrazole-3-carboxamide (SR141716A). A novel series of alkynylthiophenes as potent and selective cannabinoid-1 receptor antagonists. J Med Chem51:5397-412 (2008) 
 
Cannabinoid receptor 1
Name:Cannabinoid receptor 1
Type:G Protein-Coupled Receptor (GPCR)
Mol. Mass.:52868.96
Organism:Homo sapiens (Human)
Description:P21554
Residue:472
BDBM50253474
NameBDBM50253474
Synonyms:5-(5-(Cyclopropylethynyl)thiophen-2-yl)-1-(2,4-dichlorophenyl)-4-methyl-N-(piperidin-1-yl)-1H-pyrazole-3-carboxamide | CHEMBL493916
TypeSmall organic molecule
Emp. Form.C25H24Cl2N4OS
Mol. Mass.499.455
SMILESCc1c(nn(c1-c1ccc(s1)C#CC1CC1)-c1ccc(Cl)cc1Cl)C(=O)NN1CCCCC1