Reaction Details
TargetEstrogen receptor beta
LigandBDBM19441
Substrate/Competitorn/a
Meas. Tech.ChEMBL_535113 (CHEMBL983676)
Ki 23±n/a nM
Citation Fang, JAkwabi-Ameyaw, ABritton, JEKatamreddy, SRNavas, FMiller, ABWilliams, SPGray, DWOrband-Miller, LAShearin, JHeyer, D Synthesis of 3-alkyl naphthalenes as novel estrogen receptor ligands. Bioorg Med Chem Lett18:5075-7 (2008) 
 
Estrogen receptor beta
Name:Estrogen receptor beta
Type:Protein
Mol. Mass.:59238.43
Organism:Homo sapiens (Human)
Description:Q92731
Residue:530
BDBM19441
NameBDBM19441
Synonyms:2-(4-hydroxyphenyl)-3-({4-[2-(piperidin-1-yl)ethoxy]phenyl}carbonyl)-1-benzothiophen-6-ol Evista RALOXIFENE HYDROCHLORIDE Raloxifene (7) [6-hydroxy-2-(4-hydroxyphenyl)-1-benzothiophen-3-yl]-[4-(2-piperidin-1-ylethoxy)phenyl]methanone | cid_11071264
TypeSmall organic molecule
Emp. Form.C28H27NO4S
Mol. Mass.473.583
SMILESOc1ccc(cc1)-c1sc2cc(O)ccc2c1C(=O)c1ccc(OCCN2CCCCC2)cc1