Reaction Details
TargetEstrogen receptor beta
LigandBDBM50264121
Substrate/Competitorn/a
Meas. Tech.ChEMBL_535113 (CHEMBL983676)
Ki 16±n/a nM
Citation Fang, JAkwabi-Ameyaw, ABritton, JEKatamreddy, SRNavas, FMiller, ABWilliams, SPGray, DWOrband-Miller, LAShearin, JHeyer, D Synthesis of 3-alkyl naphthalenes as novel estrogen receptor ligands. Bioorg Med Chem Lett18:5075-7 (2008) 
 
Estrogen receptor beta
Name:Estrogen receptor beta
Type:Protein
Mol. Mass.:59238.43
Organism:Homo sapiens (Human)
Description:Q92731
Residue:530
BDBM50264121
NameBDBM50264121
Synonyms:3-(4-(3-cyclopropyl-6-hydroxy-2-phenylnaphthalen-1-yloxy)phenyl)acrylic acid | CHEMBL490197
TypeSmall organic molecule
Emp. Form.C28H22O4
Mol. Mass.422.4719
SMILESOC(=O)\C=C\c1ccc(Oc2c(-c3ccccc3)c(cc3cc(O)ccc23)C2CC2)cc1