Reaction Details
TargetCannabinoid receptor 1
LigandBDBM50132715
Substrate/Competitorn/a
Meas. Tech.ChEMBL_557789 (CHEMBL953298)
IC50 7±n/a nM
Citation Nomura, DKHudak, CSWard, AMBurston, JJIssa, RSFisher, KJAbood, MEWiley, JLLichtman, AHCasida, JE Monoacylglycerol lipase regulates 2-arachidonoylglycerol action and arachidonic acid levels. Bioorg Med Chem Lett18:5875-8 (2008) 
 
Cannabinoid receptor 1
Name:Cannabinoid receptor 1
Type:Enzyme
Mol. Mass.:52842.52
Organism:Mus musculus (Mouse)
Description:P47746
Residue:473
BDBM50132715
NameBDBM50132715
Synonyms:CHEMBL97038 dodecane-1-sulfonyl fluoride
TypeSmall organic molecule
Emp. Form.C12H25FO2S
Mol. Mass.252.389
SMILESCCCCCCCCCCCCS(F)(=O)=O