Reaction Details
TargetMonoglyceride lipase
LigandBDBM50247051
Substrate/Competitorn/a
Meas. Tech.ChEMBL_557786 (CHEMBL953295)
IC50 0.28±n/a nM
Citation Nomura, DKHudak, CSWard, AMBurston, JJIssa, RSFisher, KJAbood, MEWiley, JLLichtman, AHCasida, JE Monoacylglycerol lipase regulates 2-arachidonoylglycerol action and arachidonic acid levels. Bioorg Med Chem Lett18:5875-8 (2008) 
 
Monoglyceride lipase
Name:Monoglyceride lipase
Type:Hydrolase
Mol. Mass.:33391.67
Organism:Mus musculus (mouse)
Description:Assays were using membranes of recombinant MAG Lipase transiently transfected in COS-7 cells.
Residue:303
BDBM50247051
NameBDBM50247051
Synonyms:CHEMBL512224 | isopropyl 4-nitrophenyl dodecylphosphonate
TypeSmall organic molecule
Emp. Form.C21H36NO5P
Mol. Mass.413.488
SMILESCCCCCCCCCCCCP(=O)(OC(C)C)Oc1ccc(cc1)[N+]([O-])=O