Reaction Details
TargetCannabinoid receptor 1
LigandBDBM50132717
Substrate/Competitorn/a
Meas. Tech.ChEMBL_557838 (CHEMBL956563)
EC50 500±n/a nM
Citation Nomura, DKHudak, CSWard, AMBurston, JJIssa, RSFisher, KJAbood, MEWiley, JLLichtman, AHCasida, JE Monoacylglycerol lipase regulates 2-arachidonoylglycerol action and arachidonic acid levels. Bioorg Med Chem Lett18:5875-8 (2008) 
 
Cannabinoid receptor 1
Name:Cannabinoid receptor 1
Type:Enzyme
Mol. Mass.:52842.52
Organism:Mus musculus (Mouse)
Description:P47746
Residue:473
BDBM50132717
NameBDBM50132717
Synonyms:CHEMBL333149 isopropyl dodecylphosphonofluoridate | isopropyl dodecylphosphonofluoridoate
TypeSmall organic molecule
Emp. Form.C15H32FO2P
Mol. Mass.294.3855
SMILESCCCCCCCCCCCCP(F)(=O)OC(C)C