Reaction Details
TargetB1 bradykinin receptor
LigandBDBM50264141
Substrate/Competitorn/a
Meas. Tech.ChEMBL_535281 (CHEMBL982606)
IC50 0.8±n/a nM
Citation Guo, QChandrasekhar, JIhle, DWustrow, DJChenard, BLKrause, JEHutchison, AAlderman, DCheng, CCortright, DBroom, DKershaw, MTSimmermacher-Mayer, JPeng, YHodgetts, KJ 1-Benzylbenzimidazoles: the discovery of a novel series of bradykinin B(1) receptor antagonists. Bioorg Med Chem Lett18:5027-31 (2008) 
 
B1 bradykinin receptor
Name:B1 bradykinin receptor
Type:Enzyme Catalytic Domain
Mol. Mass.:38389.97
Organism:RAT
Description:B1 BRADYKININ BDKRB1 RAT::P97583
Residue:337
BDBM50264141
NameBDBM50264141
Synonyms:1-Benzyl-1H-benzoimidazole-2-carboxylic acid {2-[6-(4,5-dihydro-1H-imidazol-2-yl)-pyridin-3-ylcarbamoyl]-ethyl}-amide | CHEMBL491198
TypeSmall organic molecule
Emp. Form.C26H25N7O2
Mol. Mass.467.5224
SMILESO=C(CCNC(=O)c1nc2ccccc2n1Cc1ccccc1)Nc1ccc(nc1)C1=NCCN1