Reaction Details
TargetB1 bradykinin receptor
LigandBDBM50127438
Substrate/Competitorn/a
Meas. Tech.ChEMBL_535281 (CHEMBL982606)
Ki 0.92±n/a nM
Citation Guo, QChandrasekhar, JIhle, DWustrow, DJChenard, BLKrause, JEHutchison, AAlderman, DCheng, CCortright, DBroom, DKershaw, MTSimmermacher-Mayer, JPeng, YHodgetts, KJ 1-Benzylbenzimidazoles: the discovery of a novel series of bradykinin B(1) receptor antagonists. Bioorg Med Chem Lett18:5027-31 (2008) 
 
B1 bradykinin receptor
Name:B1 bradykinin receptor
Type:Enzyme Catalytic Domain
Mol. Mass.:38389.97
Organism:RAT
Description:B1 BRADYKININ BDKRB1 RAT::P97583
Residue:337
BDBM50127438
NameBDBM50127438
Synonyms:1-(2-Oxo-5-phenethyl-1-propyl-2,3-dihydro-1H-benzo[e][1,4]diazepin-3-yl)-3-[4-(4-pyridin-4-yl-piperazin-1-yl)-phenyl]-urea CHEMBL299832
TypeSmall organic molecule
Emp. Form.C36H39N7O2
Mol. Mass.601.7406
SMILESCCCN1c2ccccc2C(CCc2ccccc2)=NC(NC(=O)Nc2ccc(cc2)N2CCN(CC2)c2ccncc2)C1=O