Reaction Details
TargetAcetylcholine-binding protein
LigandBDBM50253820
Substrate/Competitorn/a
Meas. Tech.ChEMBL_512492 (CHEMBL966982)
Ki 43±n/a nM
Citation Jin, AHDaly, NLNevin, STWang, CIDutertre, SLewis, RJAdams, DJCraik, DJAlewood, PF Molecular engineering of conotoxins: the importance of loop size to alpha-conotoxin structure and function. J Med Chem51:5575-84 (2008) 
 
Acetylcholine-binding protein
Name:Acetylcholine-binding protein
Type:n/a
Mol. Mass.:26055.52
Organism:Lymnaea stagnalis
Description:Soluble acetylcholine receptor
Residue:229
BDBM50253820
NameBDBM50253820
Synonyms:(1R,6R,9S,12S,15S,21S,24S,27S,30S,33R,36S,42S,48S,51S,56R)-56-(2-aminoacetamido)-21,24-bis(carbamoylmethyl)-12-(carboxymethyl)-51-(hydroxymethyl)-9-[(4-hydroxyphenyl)methyl]-30-methyl-27,48-bis(2-methylpropyl)-8,11,14,20,23,26,29,32,35,41,47,50,53,55-tetradecaoxo-3,4,58,59-tetrathia-7,10,13,19,22,25,28,31,34,40,46,49,52,54-tetradecaazapentacyclo[31.20.7.0^{15,19}.0^{36,40}.0^{42,46}]hexacontane-6-carboxylic acid | CHEMBL510519
TypeSmall organic molecule
Emp. Form.C68H100N18O23S4
Mol. Mass.1665.888
SMILESCC(C)C[C@@H]1NC(=O)[C@H](C)NC(=O)[C@@H]2CSSC[C@H](NC(=O)CN)C(=O)N[C@@H](CSSC[C@H](NC(=O)[C@H](Cc3ccc(O)cc3)NC(=O)[C@H](CC(O)=O)NC(=O)[C@@H]3CCCN3C(=O)[C@H](CC(N)=O)NC(=O)[C@H](CC(N)=O)NC1=O)C(O)=O)C(=O)N[C@@H](CO)C(=O)N[C@@H](CC(C)C)C(=O)N1CCC[C@H]1C(=O)N1CCC[C@H]1C(=O)N2