Reaction Details
TargetTranscriptional activator protein LuxR
LigandBDBM50265810
Substrate/Competitorn/a
Meas. Tech.ChEMBL_543884 (CHEMBL1016859)
IC50 530±n/a nM
Citation Geske, GDMattmann, MEBlackwell, HE Evaluation of a focused library of N-aryl L-homoserine lactones reveals a new set of potent quorum sensing modulators. Bioorg Med Chem Lett18:5978-81 (2008) 
 
Transcriptional activator protein LuxR
Name:Transcriptional activator protein LuxR
Type:PROTEIN
Mol. Mass.:28527.37
Organism:Vibrio fischeri (strain ATCC 700601 / ES114)
Description:ChEMBL_543884
Residue:250
BDBM50265810
NameBDBM50265810
Synonyms:(S)-3-(3-bromophenyl)-N-(2-oxotetrahydrofuran-3-yl)propanamide | CHEMBL457115
TypeSmall organic molecule
Emp. Form.C13H14BrNO3
Mol. Mass.312.159
SMILESBrc1cccc(CCC(=O)N[C@H]2CCOC2=O)c1