Reaction Details
TargetD(2) dopamine receptor
LigandBDBM50253549
Substrate/Competitorn/a
Meas. Tech.ChEMBL_538660 (CHEMBL1033058)
Ki 33.4±n/a nM
Citation Paul, NMTaylor, MKumar, RDeschamps, JRLuedtke, RRNewman, AH Structure-activity relationships for a novel series of dopamine D2-like receptor ligands based on N-substituted 3-aryl-8-azabicyclo[3.2.1]octan-3-ol. J Med Chem51:6095-109 (2008) 
 
D(2) dopamine receptor
Name:D(2) dopamine receptor
Type:Cell-surface receptors
Mol. Mass.:50647.10
Organism:Homo sapiens (Human)
Description:P14416
Residue:443
BDBM50253549
NameBDBM50253549
Synonyms:3-(4-Chlorophenyl)-8-(1H-indol-3-ylmethyl)-8-azabicyclo[3.2.1]octan-3-ol endo-8-(1H-Indol-3-ylmethyl)-3-(4-chlorophenyl)-8-azabicyclo-[3.2.1]octan-3-ol
TypeSmall organic molecule
Emp. Form.C22H23ClN2O
Mol. Mass.366.884
SMILESOC1(CC2CCC(C1)N2Cc1c[nH]c2ccccc12)c1ccc(Cl)cc1