Reaction Details
TargetD(2) dopamine receptor
LigandBDBM50253637
Substrate/Competitorn/a
Meas. Tech.ChEMBL_538660 (CHEMBL1033058)
Ki 1.5±n/a nM
Citation Paul, NMTaylor, MKumar, RDeschamps, JRLuedtke, RRNewman, AH Structure-activity relationships for a novel series of dopamine D2-like receptor ligands based on N-substituted 3-aryl-8-azabicyclo[3.2.1]octan-3-ol. J Med Chem51:6095-109 (2008) 
 
D(2) dopamine receptor
Name:D(2) dopamine receptor
Type:Cell-surface receptors
Mol. Mass.:50647.10
Organism:Homo sapiens (Human)
Description:P14416
Residue:443
BDBM50253637
NameBDBM50253637
Synonyms:CHEMBL462043 | endo-8-(5-Methoxybenzofur-3-ylmethyl)-3-(4-chlorophenyl)-8-azabicyclo[3.2.1]octan-3-ol
TypeSmall organic molecule
Emp. Form.C23H24ClNO3
Mol. Mass.397.895
SMILESCOc1ccc2occ(CN3C4CCC3CC(O)(C4)c3ccc(Cl)cc3)c2c1