Reaction Details
TargetD(2) dopamine receptor
LigandBDBM50253617
Substrate/Competitorn/a
Meas. Tech.ChEMBL_538660 (CHEMBL1033058)
Ki 29.8±n/a nM
Citation Paul, NMTaylor, MKumar, RDeschamps, JRLuedtke, RRNewman, AH Structure-activity relationships for a novel series of dopamine D2-like receptor ligands based on N-substituted 3-aryl-8-azabicyclo[3.2.1]octan-3-ol. J Med Chem51:6095-109 (2008) 
 
D(2) dopamine receptor
Name:D(2) dopamine receptor
Type:Cell-surface receptors
Mol. Mass.:50647.10
Organism:Homo sapiens (Human)
Description:P14416
Residue:443
BDBM50253617
NameBDBM50253617
Synonyms:CHEMBL493277 | endo-8-(Benzothien-3-ylmethyl)-3-(3,4-dichlorophenyl)-8-azabicyclo[3.2.1]octan-3-ol
TypeSmall organic molecule
Emp. Form.C22H21Cl2NOS
Mol. Mass.418.379
SMILESOC1(CC2CCC(C1)N2Cc1csc2ccccc12)c1ccc(Cl)c(Cl)c1