Reaction Details
TargetD(3) dopamine receptor
LigandBDBM50253635
Substrate/Competitorn/a
Meas. Tech.ChEMBL_538661 (CHEMBL1033059)
Ki 1.2±n/a nM
Citation Paul, NMTaylor, MKumar, RDeschamps, JRLuedtke, RRNewman, AH Structure-activity relationships for a novel series of dopamine D2-like receptor ligands based on N-substituted 3-aryl-8-azabicyclo[3.2.1]octan-3-ol. J Med Chem51:6095-109 (2008) 
 
D(3) dopamine receptor
Name:D(3) dopamine receptor
Type:n/a
Mol. Mass.:44243.43
Organism:Homo sapiens (Human)
Description:n/a
Residue:400
BDBM50253635
NameBDBM50253635
Synonyms:CHEMBL517588 | endo-8-(Benzofur-3-ylmethyl)-3-(4-fluorophenyl)-8-azabicyclo[3.2.1]octan-3-ol
TypeSmall organic molecule
Emp. Form.C22H22FNO2
Mol. Mass.351.414
SMILESOC1(CC2CCC(C1)N2Cc1coc2ccccc12)c1ccc(F)cc1